Target
Muscarinic acetylcholine receptor M5
Ligand
BDBM50028304
Substrate
Meas. Tech.
ChEBML_139742
IC50
3500±n/a nM
Citation
 Griffith, RCGentile, RJRobichaud, RCFrankenheim, J cis-1,3,4,6,7,11b-Hexahydro-2-methyl-7-phenyl-2H-pyrazino[2,1-a] isoquinoline: a new atypical antidepressant. J Med Chem 27:995-1003 (1984)  
Target
Name:
Muscarinic acetylcholine receptor M5
Synonyms:
ACM5_RAT Chrm-5 Muscarinic acetylcholine receptor | Muscarinic acetylcholine receptor M5
Type:
Enzyme Catalytic Domain
Mol. Mass.:
60161.80
Organism:
RAT
Description:
Cholinergic, muscarinic M5 CHRM5 RAT::P08911
Residue:
531
  
Inhibitor
Name:
BDBM50028304
Synonyms:
CHEMBL266801 | cis-2-Methyl-7-(4-nitro-phenyl)-1,3,4,6,7,11b-hexahydro-2H-pyrazino[2,1-a]isoquinoline
Type:
Small organic molecule
Emp. Form.:
C19H21N3O2
Mol. Mass.:
323.3889
SMILES:
CN1CCN2CC(c3ccc(cc3)[N+]([O-])=O)c3ccccc3C2C1
: