Target
Dihydrofolate reductase
Ligand
BDBM50026308
Substrate
Meas. Tech.
ChEBML_54543
Ki
0.035000±n/a nM
Citation
 Kuyper, LFRoth, BBaccanari, DPFerone, RBeddell, CRChampness, JNStammers, DKDann, JGNorrington, FEBaker, DJGoodford, PJ Receptor-based design of dihydrofolate reductase inhibitors: comparison of crystallographically determined enzyme binding with enzyme affinity in a series of carboxy-substituted trimethoprim analogues. J Med Chem 25:1120-2 (1983)  
Target
Name:
Dihydrofolate reductase
Synonyms:
Dihydrofolate reductase (F31V) | dfrA17
Type:
Mol. Mass.:
17532.46
Organism:
Escherichia coli
Description:
Residue:
157
  
Inhibitor
Name:
BDBM50026308
Synonyms:
4-[5-(2,4-Diamino-pyrimidin-5-ylmethyl)-2,3-dimethoxy-phenoxy]-butyric acid TCMDC-137359
Type:
Small organic molecule
Emp. Form.:
C17H22N4O5
Mol. Mass.:
362.3804
SMILES:
COc1cc(Cc2cnc(N)nc2N)cc(OCCCC(O)=O)c1OC
: