Target
Pepsin A
Ligand
BDBM50025530
Substrate
Meas. Tech.
ChEBML_154018
Ki
8.6±n/a nM
Citation
 Rich, DHBernatowicz, MS Synthesis of analogues of the carboxyl protease inhibitor pepstatin. Effect of structure in subsite P3 on inhibition of pepsin. J Med Chem 25:791-5 (1982)  
Target
Name:
Pepsin A
Synonyms:
PEPA_PIG Pepsin | Pepsin A precursor
Type:
Enzyme
Mol. Mass.:
41232.87
Organism:
Porcine
Description:
Residue:
385
  
Inhibitor
Name:
BDBM50025530
Synonyms:
BDBM50028390 [1-(1-{1-Hydroxy-2-[1-(3-methyl-butylcarbamoyl)-ethylcarbamoyl]-ethyl}-3-methyl-butylcarbamoyl)-2-methyl-propyl]-carbamic acid isopropyl ester
Type:
Small organic molecule
Emp. Form.:
C25H48N4O6
Mol. Mass.:
500.6718
SMILES:
CC(C)CCNC(=O)[C@H](C)NC(=O)C[C@H](O)[C@H](CC(C)C)NC(=O)[C@@H](NC(=O)OC(C)C)C(C)C
: