Target
Pepsin A
Ligand
BDBM50025532
Substrate
Meas. Tech.
ChEBML_154018
Ki
0.180000±n/a nM
Citation
 Rich, DHBernatowicz, MS Synthesis of analogues of the carboxyl protease inhibitor pepstatin. Effect of structure in subsite P3 on inhibition of pepsin. J Med Chem 25:791-5 (1982)  
Target
Name:
Pepsin A
Synonyms:
PEPA_PIG Pepsin | Pepsin A precursor
Type:
Enzyme
Mol. Mass.:
41232.87
Organism:
Porcine
Description:
Residue:
385
  
Inhibitor
Name:
BDBM50025532
Synonyms:
3-Hydroxy-6-methyl-4-[3-methyl-2-(2-methyl-butyrylamino)-butyrylamino]-heptanoic acid [1-(3-methyl-butylcarbamoyl)-ethyl]-amide CHEMBL165448
Type:
Small organic molecule
Emp. Form.:
C27H52N4O5
Mol. Mass.:
512.7256
SMILES:
CCC(CC)C(=O)N[C@@H](C(C)C)C(=O)N[C@@H](CC(C)C)[C@@H](O)CC(=O)N[C@@H](C)C(=O)NCCC(C)C
: