Target
HIV-1 protease
Ligand
BDBM50213021
Substrate
Meas. Tech.
ChEMBL_538759 (CHEMBL1024878)
Ki
9.0±n/a nM
Citation
 Kovalevsky, AYGhosh, AKWeber, IT Solution kinetics measurements suggest HIV-1 protease has two binding sites for darunavir and amprenavir. J Med Chem 51:6599-603 (2008)  
Target
Name:
HIV-1 protease
Synonyms:
HIV-1 protease
Type:
PROTEIN
Mol. Mass.:
10795.19
Organism:
Human immunodeficiency virus
Description:
ChEMBL_118439
Residue:
99
  
Inhibitor
Name:
BDBM50213021
Synonyms:
CHEBI:63621 Invirase Ro-318959000 US10806794, Compound Saquinavir
Type:
Small organic molecule
Emp. Form.:
C38H50N6O5
Mol. Mass.:
670.8408
SMILES:
[H][C@@]12CCCC[C@]1([H])CN(C[C@@H](O)[C@H](Cc1ccccc1)NC(=O)[C@H](CC(N)=O)NC(=O)c1ccc3ccccc3n1)[C@@H](C2)C(=O)NC(C)(C)C
: