Target
Reverse transcriptase
Ligand
BDBM50067212
Substrate
Meas. Tech.
ChEMBL_545151 (CHEMBL1018093)
IC50
>1190000±n/a nM
Citation
 Tan, GTPezzuto, JMKinghorn, ADHughes, SH Evaluation of natural products as inhibitors of human immunodeficiency virus type 1 (HIV-1) reverse transcriptase. J Nat Prod 54:143-54 
Target
Name:
Reverse transcriptase
Synonyms:
Type:
Protein
Mol. Mass.:
29598.37
Organism:
Human immunodeficiency virus 1
Description:
Q9WKE8
Residue:
254
  
Inhibitor
Name:
BDBM50067212
Synonyms:
CHEBI:8093 Duo-Medihaler | Phenylephrine
Type:
Small organic molecule
Emp. Form.:
C9H13NO2
Mol. Mass.:
167.205
SMILES:
CNC[C@H](O)c1cccc(O)c1
: