Target
Enoyl-[acyl-carrier-protein] reductase [NADH] FabI
Ligand
BDBM50481105
Substrate
Meas. Tech.
ChEMBL_597843 (CHEMBL1039106)
IC50
14±n/a nM
Citation
 Ramnauth, JSurman, MDSampson, PBForrest, BWilson, JFreeman, EManning, DDMartin, FToro, ADomagala, MAwrey, DEBardouniotis, EKaplan, NBerman, JPauls, HW 2,3,4,5-Tetrahydro-1H-pyrido[2,3-b and e][1,4]diazepines as inhibitors of the bacterial enoyl ACP reductase, FabI. Bioorg Med Chem Lett 19:5359-62 (2009)  
Target
Name:
Enoyl-[acyl-carrier-protein] reductase [NADH] FabI
Synonyms:
Enoyl - (acyl carrier protein) reductase Enoyl-[acyl-carrier-protein] reductase FABI_ECOLI envM | fabI
Type:
Enzyme
Mol. Mass.:
27861.12
Organism:
Escherichia coli
Description:
Residue:
262
  
Inhibitor
Name:
BDBM50481105
Synonyms:
CHEMBL567313
Type:
Small organic molecule
Emp. Form.:
C22H24N4OS
Mol. Mass.:
392.517
SMILES:
CN(Cc1sc2ccccc2c1C)C(=O)\C=C\c1cnc2NCCCNc2c1
: