Target
Mannose-6-phosphate isomerase
Ligand
BDBM50481224
Substrate
Meas. Tech.
ChEMBL_604866 (CHEMBL1065975)
Ki
115000±n/a nM
Citation
 Foret, Jde Courcy, BGresh, NPiquemal, JPSalmon, L Synthesis and evaluation of non-hydrolyzable D-mannose 6-phosphate surrogates reveal 6-deoxy-6-dicarboxymethyl-D-mannose as a new strong inhibitor of phosphomannose isomerases. Bioorg Med Chem 17:7100-7 (2009)  
Target
Name:
Mannose-6-phosphate isomerase
Synonyms:
5.3.1.8 Phosphohexomutase manA | pmi
Type:
PROTEIN
Mol. Mass.:
42841.87
Organism:
Escherichia coli (strain K12)
Description:
ChEMBL_109157
Residue:
391
  
Inhibitor
Name:
BDBM50481224
Synonyms:
CHEMBL611642
Type:
Small organic molecule
Emp. Form.:
C9H14O9
Mol. Mass.:
266.2021
SMILES:
OC1O[C@H](CC(C(O)=O)C(O)=O)[C@@H](O)[C@H](O)[C@@H]1O
: