Target
Alpha-tocopherol transfer protein
Ligand
BDBM50481297
Substrate
Meas. Tech.
ChEMBL_605568 (CHEMBL1069214)
Kd
1130±n/a nM
Citation
 López, GVGómez, LECampillo, NPáez, JAGiles, KAtkinson, JGonzález, MRubbo, HCerecetto, H Interaction studies between human alpha-tocopherol transfer protein and nitric oxide donor tocopherol analogues with LDL-protective activity. Bioorg Med Chem 17:8143-8 (2009)  
Target
Name:
Alpha-tocopherol transfer protein
Synonyms:
Alpha-TTP TPP1 TTPA_HUMAN
Type:
PROTEIN
Mol. Mass.:
31754.31
Organism:
Homo sapiens
Description:
ChEMBL_109106
Residue:
278
  
Inhibitor
Name:
BDBM50481297
Synonyms:
CHEMBL595636
Type:
Small organic molecule
Emp. Form.:
C29H49NO5
Mol. Mass.:
491.7031
SMILES:
CC(C)CCCC(C)CCCC(C)CCCC1(C)CCc2c(CO[N+]([O-])=O)c(O)c(C)c(C)c2O1
: