Target
Protease
Ligand
BDBM50481579
Substrate
Meas. Tech.
ChEMBL_610130 (CHEMBL1074495)
Ki
0.290000±n/a nM
Citation
 Ghosh, AKGemma, SSimoni, EBaldridge, AWalters, DEIde, KTojo, YKoh, YAmano, MMitsuya, H Synthesis and biological evaluation of novel allophenylnorstatine-based HIV-1 protease inhibitors incorporating high affinity P2-ligands. Bioorg Med Chem Lett 20:1241-6 (2010)  
Target
Name:
Protease
Synonyms:
Type:
Enzyme
Mol. Mass.:
10904.79
Organism:
Human immunodeficiency virus 1 (HIV-1)
Description:
Q9YQ12
Residue:
99
  
Inhibitor
Name:
BDBM50481579
Synonyms:
CHEMBL601049
Type:
Small organic molecule
Emp. Form.:
C32H41N3O6S
Mol. Mass.:
595.749
SMILES:
[H][C@@]12CCO[C@]1([H])C[C@@H](C2)OC(=O)N[C@@H](Cc1ccccc1)[C@H](O)C(=O)N1CSC(C)(C)[C@H]1C(=O)NCc1ccccc1C
: