Target
Protease
Ligand
BDBM50481583
Substrate
Meas. Tech.
ChEMBL_610130 (CHEMBL1074495)
Ki
0.650000±n/a nM
Citation
 Ghosh, AKGemma, SSimoni, EBaldridge, AWalters, DEIde, KTojo, YKoh, YAmano, MMitsuya, H Synthesis and biological evaluation of novel allophenylnorstatine-based HIV-1 protease inhibitors incorporating high affinity P2-ligands. Bioorg Med Chem Lett 20:1241-6 (2010)  
Target
Name:
Protease
Synonyms:
Type:
Enzyme
Mol. Mass.:
10904.79
Organism:
Human immunodeficiency virus 1 (HIV-1)
Description:
Q9YQ12
Residue:
99
  
Inhibitor
Name:
BDBM50481583
Synonyms:
CHEMBL601050
Type:
Small organic molecule
Emp. Form.:
C31H39N3O7S
Mol. Mass.:
597.722
SMILES:
[H][C@@]12C[C@@H](C[C@]1([H])OCO2)OC(=O)N[C@@H](Cc1ccccc1)[C@H](O)C(=O)N1CSC(C)(C)[C@H]1C(=O)NCc1ccccc1C
: