Target
Integrase
Ligand
BDBM25351
Substrate
Meas. Tech.
ChEMBL_647171 (CHEMBL1217312)
IC50
9.0±n/a nM
Citation
 Ferro, SDe Luca, LBarreca, MLDe Grazia, SChrist, FDebyser, ZChimirri, A New chloro,fluorobenzylindole derivatives as integrase strand-transfer inhibitors (INSTIs) and their mode of action. Bioorg Med Chem 18:5510-8 (2010)  
Target
Name:
Integrase
Synonyms:
pol
Type:
PROTEIN
Mol. Mass.:
32203.43
Organism:
Human immunodeficiency virus 1
Description:
ChEMBL_106649
Residue:
288
  
Inhibitor
Name:
BDBM25351
Synonyms:
N-[2-(4-{[(4-fluorophenyl)methyl]carbamoyl}-5-hydroxy-1-methyl-6-oxo-1,6-dihydropyrimidin-2-yl)propan-2-yl]-5-methyl-1,3,4-oxadiazole-2-carboxamide | Raltegravir
Type:
Small organic molecule
Emp. Form.:
C20H21FN6O5
Mol. Mass.:
444.4163
SMILES:
Cc1nnc(o1)C(=O)NC(C)(C)c1nc(C(=O)NCc2ccc(F)cc2)c(O)c(=O)n1C
: