Target
Genome polyprotein
Ligand
BDBM50482598
Substrate
Meas. Tech.
ChEMBL_651836 (CHEMBL1227201)
Ki
6000±n/a nM
Citation
 Ortqvist, PGising, JEhrenberg, AEVema, ABorg, AKarlén, ALarhed, MDanielson, UHSandström, A Discovery of achiral inhibitors of the hepatitis C virus NS3 protease based on 2(1H)-pyrazinones. Bioorg Med Chem 18:6512-25 (2010)  
Target
Name:
Genome polyprotein
Synonyms:
Protease NS3/Non-structural protein 4A (NS3/NS4A) | Protease NS3/Non-structural protein 4A (NS3/NS4A) (D168V)
Type:
Enzyme
Mol. Mass.:
19121.30
Organism:
Hepatitis C virus genotype 1b (isolate Con1) (HCV)
Description:
Q91RS4
Residue:
181
  
Inhibitor
Name:
BDBM50482598
Synonyms:
CHEMBL1222902
Type:
Small organic molecule
Emp. Form.:
C28H21ClF3N5O7S
Mol. Mass.:
664.009
SMILES:
OC(=O)CNc1nc(Cl)c(-c2ccccc2)n(CC(=O)Nc2ccccc2C(=O)NS(=O)(=O)c2ccc(cc2)C(F)(F)F)c1=O
: