Target
Alpha-1,2-mannosidase, putative
Ligand
BDBM50482721
Substrate
Meas. Tech.
ChEMBL_662786 (CHEMBL1252525)
Ki
140000±n/a nM
Citation
 Zhu, YSuits, MDThompson, AJChavan, SDinev, ZDumon, CSmith, NMoremen, KWXiang, YSiriwardena, AWilliams, SJGilbert, HJDavies, GJ Mechanistic insights into a Ca2+-dependent family of alpha-mannosidases in a human gut symbiont. Nat Chem Biol 6:125-32 (2010)  
Target
Name:
Alpha-1,2-mannosidase, putative
Synonyms:
Alpha-1,2-mannosidase, putative
Type:
PROTEIN
Mol. Mass.:
87740.67
Organism:
Bacteroides thetaiotaomicron
Description:
ChEMBL_117209
Residue:
782
  
Inhibitor
Name:
BDBM50482721
Synonyms:
Kifunensine
Type:
Small organic molecule
Emp. Form.:
C8H12N2O6
Mol. Mass.:
232.1907
SMILES:
[H][C@]12NC(=O)C(=O)N1[C@H](CO)[C@@H](O)[C@H](O)[C@@H]2O
: