Target
Neuraminidase
Ligand
BDBM50482873
Substrate
Meas. Tech.
ChEMBL_675040 (CHEMBL1272774)
IC50
93770±n/a nM
Citation
 Dao, TTTung, BTNguyen, PHThuong, PTYoo, SSKim, EHKim, SKOh, WK C-Methylated Flavonoids from Cleistocalyx operculatus and Their Inhibitory Effects on Novel Influenza A (H1N1) Neuraminidase. J Nat Prod 73:1636-42 (2010)  
Target
Name:
Neuraminidase
Synonyms:
NA | NRAM_I33A0
Type:
PROTEIN
Mol. Mass.:
49687.56
Organism:
Influenza A virus
Description:
ChEMBL_1347422
Residue:
453
  
Inhibitor
Name:
BDBM50482873
Synonyms:
CHEBI:70659 | CHEMBL1271362
Type:
Small organic molecule
Emp. Form.:
C17H16O4
Mol. Mass.:
284.3065
SMILES:
COc1cc(O)c(C)c(O)c1C(=O)\C=C\c1ccccc1
: