Target
Histamine H4 receptor
Ligand
BDBM50275884
Substrate
Meas. Tech.
ChEMBL_697508 (CHEMBL1638840)
EC50
7.9±n/a nM
Citation
 Igel, PDove, SBuschauer, A Histamine H4 receptor agonists. Bioorg Med Chem Lett 20:7191-9 (2010)  
Target
Name:
Histamine H4 receptor
Synonyms:
AXOR35 GPCR105 HH4R HRH4 Histamine H4 receptor Histamine receptor (H3 and H4) SP9144
Type:
G Protein-Coupled Receptor (GPCR)
Mol. Mass.:
44517.02
Organism:
Homo sapiens (Human)
Description:
Binding assays were using CHO cells stably expressing hH4R receptors.
Residue:
390
  
Inhibitor
Name:
BDBM50275884
Synonyms:
CHEMBL471413 | N1-(3,3-Diphenylpropanoyl)-N2-[3-(1H-imidazol-4-yl)propyl]guanidine
Type:
Small organic molecule
Emp. Form.:
C22H25N5O
Mol. Mass.:
375.4668
SMILES:
NC(NC(=O)CC(c1ccccc1)c1ccccc1)=NCCCc1cnc[nH]1
: