Target
5-hydroxytryptamine receptor 4
Ligand
BDBM50483177
Substrate
Meas. Tech.
ChEMBL_697177 (CHEMBL1640597)
Ki
2.5±n/a nM
Citation
 Brudeli, BMoltzau, LRAndressen, KWKrobert, KAKlaveness, JLevy, FO Synthesis and pharmacological properties of novel hydrophilic 5-HT4 receptor antagonists. Bioorg Med Chem 18:8600-13 (2010)  
Target
Name:
5-hydroxytryptamine receptor 4
Synonyms:
5-HT-4 5-HT4S 5-HT4b 5-HT4d 5-hydroxytryptamine receptor 4 5HT4R_HUMAN Serotonin (5-HT) receptor Serotonin 4 (5-HT4) receptor | Serotonin Receptor 4
Type:
Enzyme
Mol. Mass.:
43767.54
Organism:
Homo sapiens (Human)
Description:
Q13639
Residue:
388
  
Inhibitor
Name:
BDBM50483177
Synonyms:
CHEMBL1632175
Type:
Small organic molecule
Emp. Form.:
C30H45N3O4
Mol. Mass.:
511.696
SMILES:
OC(=O)CCCCCCCCCCCN1CCC(CNC(=O)c2c3OCCCn3c3ccccc23)CC1
: