Target
Phenylethanolamine N-methyltransferase
Ligand
BDBM50028632
Substrate
Meas. Tech.
ChEBML_142786
Ki
86000±n/a nM
Citation
 Rafferty, MFWilson, DSMonn, JAKrass, PBorchardt, RTGrunewald, GL Importance of the aromatic ring in adrenergic amines. 7. Comparison of the stereoselectivity of norepinephrine N-methyltransferase for aromatic vs. nonaromatic substrates and inhibitors. J Med Chem 25:1198-204 (1983)  
Target
Name:
Phenylethanolamine N-methyltransferase
Synonyms:
Noradrenaline N-methyltransferase PNMT_BOVIN | PNMTase
Type:
Enzyme
Mol. Mass.:
30916.97
Organism:
Bos taurus (bovine)
Description:
Residue:
283
  
Inhibitor
Name:
BDBM50028632
Synonyms:
2-Cyclooctyl-1-methyl-ethylamine | CHEMBL278330
Type:
Small organic molecule
Emp. Form.:
C11H23N
Mol. Mass.:
169.307
SMILES:
CC(N)CC1CCCCCCC1
: