Target
Neuraminidase
Ligand
BDBM50483015
Substrate
Meas. Tech.
ChEMBL_698043 (CHEMBL1645794)
IC50
76300±n/a nM
Citation
 Dao, TTNguyen, PHLee, HSKim, EPark, JLim, SIOh, WK Chalcones as novel influenza A (H1N1) neuraminidase inhibitors from Glycyrrhiza inflata. Bioorg Med Chem Lett 21:294-8 (2011)  
Target
Name:
Neuraminidase
Synonyms:
NA | NRAM_I33A0
Type:
PROTEIN
Mol. Mass.:
49687.56
Organism:
Influenza A virus
Description:
ChEMBL_1347422
Residue:
453
  
Inhibitor
Name:
BDBM50483015
Synonyms:
5''-Prenylbutein | 5'-PRENYLBUTEIN
Type:
Small organic molecule
Emp. Form.:
C20H20O5
Mol. Mass.:
340.3698
SMILES:
[#6]\[#6](-[#6])=[#6]\[#6]-c1cc(\[#6]=[#6]\[#6](=O)-c2ccc(-[#8])cc2-[#8])cc(-[#8])c1-[#8]
: