Target
Protease
Ligand
BDBM50483335
Substrate
Meas. Tech.
ChEMBL_715372 (CHEMBL1664701)
Ki
0.085000±n/a nM
Citation
 Ghosh, AKChapsal, BDBaldridge, ASteffey, MPWalters, DEKoh, YAmano, MMitsuya, H Design and synthesis of potent HIV-1 protease inhibitors incorporating hexahydrofuropyranol-derived high affinity P(2) ligands: structure-activity studies and biological evaluation. J Med Chem 54:622-34 (2011)  
Target
Name:
Protease
Synonyms:
Type:
Enzyme
Mol. Mass.:
10904.79
Organism:
Human immunodeficiency virus 1 (HIV-1)
Description:
Q9YQ12
Residue:
99
  
Inhibitor
Name:
BDBM50483335
Synonyms:
CHEMBL1651161
Type:
Small organic molecule
Emp. Form.:
C29H40N2O8S
Mol. Mass.:
576.701
SMILES:
[H][C@@]12CCO[C@]1([H])OCC[C@@H]2OC(=O)N[C@@H](Cc1ccccc1)[C@H](O)CN(CC(C)C)S(=O)(=O)c1ccc(CO)cc1
: