Target
Integrase
Ligand
BDBM26985
Substrate
Meas. Tech.
ChEMBL_717766 (CHEMBL1671440)
IC50
1200±n/a nM
Citation
 Bodiwala, HSSabde, SGupta, PMukherjee, RKumar, RGarg, PBhutani, KKMitra, DSingh, IP Design and synthesis of caffeoyl-anilides as portmanteau inhibitors of HIV-1 integrase and CCR5. Bioorg Med Chem 19:1256-63 (2011)  
Target
Name:
Integrase
Synonyms:
pol
Type:
PROTEIN
Mol. Mass.:
32203.43
Organism:
Human immunodeficiency virus 1
Description:
ChEMBL_106649
Residue:
288
  
Inhibitor
Name:
BDBM26985
Synonyms:
2-triaza-1,2-diyne CHEMBL89295 azide
Type:
Ion
Emp. Form.:
N3
Mol. Mass.:
42.0206
SMILES:
[N-]=[N+]=[N-]
: