Target
Platelet glycoprotein 4
Ligand
BDBM50483628
Substrate
Meas. Tech.
ChEMBL_740315 (CHEMBL1764261)
IC50
633±n/a nM
Citation
 Wang, YXWang, LXu, YNLi, YHJiang, JDSi, SYLi, YBRen, GShan, YQHong, BSong, DQ Synthesis and structure-activity relationship of N-(2-arylethyl) isoquinoline derivatives as human scavenger receptor CD36 antagonists. Eur J Med Chem 46:1066-73 (2011)  
Target
Name:
Platelet glycoprotein 4
Synonyms:
CD36 CD_antigen=CD36 Fatty acid translocase GP4 GPIV Leukocyte differentiation antigen CD36 PAS-4 Platelet glycoprotein 4 Thrombospondin receptor
Type:
PROTEIN
Mol. Mass.:
53057.78
Organism:
Homo sapiens
Description:
ChEMBL_104107
Residue:
472
  
Inhibitor
Name:
BDBM50483628
Synonyms:
CHEMBL1761157
Type:
Small organic molecule
Emp. Form.:
C18H18ClNO2
Mol. Mass.:
315.794
SMILES:
[Cl-].COc1ccc2cc[n+](CCc3ccccc3)cc2c1O
: