Target
Beta-glucuronidase
Ligand
BDBM33577
Substrate
Meas. Tech.
ChEMBL_757810 (CHEMBL1809754)
IC50
36100±n/a nM
Citation
 Khan, KMRahim, FHalim, SATaha, MKhan, MPerveen, SZaheer-Ul-Haq, naMesaik, MAIqbal Choudhary, M Synthesis of novel inhibitors of ?-glucuronidase based on benzothiazole skeleton and study of their binding affinity by molecular docking. Bioorg Med Chem 19:4286-94 (2011)  
Target
Name:
Beta-glucuronidase
Synonyms:
Beta-glucuronidase EMBL:AAI33416.1 Ensembl:ENSBTAP00000000941} | GUSB
Type:
Protein
Mol. Mass.:
74467.69
Organism:
Bos taurus (Bovine)
Description:
EC 3.2.1.31, bovine liver
Residue:
652
  
Inhibitor
Name:
BDBM33577
Synonyms:
3-(1,3-benzothiazol-2-yl)phenol SMR000074978 | cid_242605
Type:
Small organic molecule
Emp. Form.:
C13H9NOS
Mol. Mass.:
227.282
SMILES:
Oc1cccc(c1)-c1nc2ccccc2s1
: