Target
Protease
Ligand
BDBM50484191
Substrate
Meas. Tech.
ChEMBL_763964 (CHEMBL1820047)
Ki
0.006000±n/a nM
Citation
 Ghosh, AKChapsal, BDParham, GLSteffey, MAgniswamy, JWang, YFAmano, MWeber, ITMitsuya, H Design of HIV-1 protease inhibitors with C3-substituted hexahydrocyclopentafuranyl urethanes as P2-ligands: synthesis, biological evaluation, and protein-ligand X-ray crystal structure. J Med Chem 54:5890-901 (2011)  
Target
Name:
Protease
Synonyms:
Type:
Enzyme
Mol. Mass.:
10904.79
Organism:
Human immunodeficiency virus 1 (HIV-1)
Description:
Q9YQ12
Residue:
99
  
Inhibitor
Name:
BDBM50484191
Synonyms:
CHEMBL1819295
Type:
Small organic molecule
Emp. Form.:
C30H42N2O8S
Mol. Mass.:
590.728
SMILES:
[H][C@@]12C[C@@H](C[C@]1([H])[C@H](CO2)OC)OC(=O)N[C@@H](Cc1ccccc1)[C@H](O)CN(CC(C)C)S(=O)(=O)c1ccc(OC)cc1
: