Target
Protease
Ligand
BDBM50484192
Substrate
Meas. Tech.
ChEMBL_763964 (CHEMBL1820047)
Ki
13±n/a nM
Citation
 Ghosh, AKChapsal, BDParham, GLSteffey, MAgniswamy, JWang, YFAmano, MWeber, ITMitsuya, H Design of HIV-1 protease inhibitors with C3-substituted hexahydrocyclopentafuranyl urethanes as P2-ligands: synthesis, biological evaluation, and protein-ligand X-ray crystal structure. J Med Chem 54:5890-901 (2011)  
Target
Name:
Protease
Synonyms:
Type:
Enzyme
Mol. Mass.:
10904.79
Organism:
Human immunodeficiency virus 1 (HIV-1)
Description:
Q9YQ12
Residue:
99
  
Inhibitor
Name:
BDBM50484192
Synonyms:
CHEMBL1819298
Type:
Small organic molecule
Emp. Form.:
C31H45N3O7S
Mol. Mass.:
603.77
SMILES:
[H][C@@]12C[C@@H](C[C@]1([H])[C@@H](CO2)N(C)C)OC(=O)N[C@@H](Cc1ccccc1)[C@H](O)CN(CC(C)C)S(=O)(=O)c1ccc(OC)cc1
: