Target
Serine/threonine-protein kinase B-raf
Ligand
BDBM50484702
Substrate
Meas. Tech.
ChEMBL_800394 (CHEMBL1948325)
IC50
310±n/a nM
Citation
 Wenglowsky, SRen, LAhrendt, KALaird, ERAliagas, IAlicke, BBuckmelter, AJChoo, EFDinkel, VFeng, BGloor, SLGould, SEGross, SGunzner-Toste, JHansen, JDHatzivassiliou, GLiu, BMalesky, KMathieu, SNewhouse, BRaddatz, NJRan, YRana, SRandolph, NRisom, TRudolph, JSavage, SSelby, LTShrag, MSong, KSturgis, HLVoegtli, WCWen, ZWillis, BSWoessner, RDWu, WIYoung, WBGrina, J Pyrazolopyridine Inhibitors of B-Raf(V600E). Part 1: The Development of Selective, Orally Bioavailable, and Efficacious Inhibitors. ACS Med Chem Lett 2:342-7 (2011)  
Target
Name:
Serine/threonine-protein kinase B-raf
Synonyms:
B-RAF B-Raf proto-oncogene serine/threonine-protein kinase BRAF1 RAFB1 v-Raf murine sarcoma viral oncogene homolog B1
Type:
Serine/threonine-protein kinase
Mol. Mass.:
84446.00
Organism:
Homo sapiens (Human)
Description:
P15056
Residue:
766
  
Inhibitor
Name:
BDBM50484702
Synonyms:
CHEMBL1945020
Type:
Small organic molecule
Emp. Form.:
C15H15BrF2N4O3S
Mol. Mass.:
449.27
SMILES:
CCCS(=O)(=O)Nc1ccc(F)c(C(=O)Nc2cnc(N)c(Br)c2)c1F
: