Target
Protease
Ligand
BDBM50484844
Substrate
Meas. Tech.
ChEMBL_807142 (CHEMBL1959806)
Ki
0.02±n/a nM
Citation
 Ghosh, AKChapsal, BDSteffey, MAgniswamy, JWang, YFAmano, MWeber, ITMitsuya, H Substituent effects on P2-cyclopentyltetrahydrofuranyl urethanes: design, synthesis, and X-ray studies of potent HIV-1 protease inhibitors. Bioorg Med Chem Lett 22:2308-11 (2012)  
Target
Name:
Protease
Synonyms:
Type:
Enzyme
Mol. Mass.:
10904.79
Organism:
Human immunodeficiency virus 1 (HIV-1)
Description:
Q9YQ12
Residue:
99
  
Inhibitor
Name:
BDBM50484844
Synonyms:
CHEMBL1958486
Type:
Small organic molecule
Emp. Form.:
C32H45N3O9S
Mol. Mass.:
647.779
SMILES:
[H][C@@]12C[C@@H](C[C@]1([H])[C@H](CO2)OC(=O)N(C)C)OC(=O)N[C@@H](Cc1ccccc1)[C@H](O)CN(CC(C)C)S(=O)(=O)c1ccc(OC)cc1
: