Target
Amyloid-beta precursor protein
Ligand
BDBM50484947
Substrate
Meas. Tech.
ChEMBL_813734 (CHEMBL2019992)
Ki
3.2±n/a nM
Citation
 Yousefi, BHDrzezga, Avon Reutern, BManook, ASchwaiger, MWester, HJHenriksen, G A Novel (18)F-Labeled Imidazo[2,1-b]benzothiazole (IBT) for High-Contrast PET Imaging of ?-Amyloid Plaques. ACS Med Chem Lett 2:673-7 (2011)  
Target
Name:
Amyloid-beta precursor protein
Synonyms:
A4 ABPP AICD-50 AICD-59 AID(57) APP Alzheimer disease amyloid protein Amyloid beta Protein Amyloid beta protein Abeta(1-42) Amyloid intracellular domain 57 Amyloid protein (Abeta42b) Beta amyloid A4 protein Beta-APP42 Beta-amyloid protein 42 C83 CVAP Gamma Secretase Gamma-CTF(57) Gamma-secretase Gamma-secretase C-terminal fragment 57 P3(40) PN-II Protease nexin-II S-APP-beta Soluble APP-beta | beta-Amyloid Precursor Protein (APP)
Type:
Single-pass type I membrane protein
Mol. Mass.:
86890.41
Organism:
Homo sapiens (Human)
Description:
P05067
Residue:
770
  
Inhibitor
Name:
BDBM50484947
Synonyms:
CHEMBL2017621
Type:
Small organic molecule
Emp. Form.:
C18H16FN3OS
Mol. Mass.:
340.405
SMILES:
CNc1ccc(cc1)-c1cn2c(n1)sc1cc(OCC[18F])ccc21
: