Target
1,3-beta-D-glucan synthase catalytic subunit
Ligand
BDBM50485393
Substrate
Meas. Tech.
ChEMBL_830523 (CHEMBL2061335)
IC50
91.5±n/a nM
Citation
 Kuang, RWu, HTing, PCAslanian, RGCao, JKim, DWLee, JFSchwerdt, JZhou, GHerr, RJZych, AJYang, JLam, SQJenkins, DMSakwa, SAWainhaus, SBlack, TACacciapuoti, AMcNicholas, PMXu, YWalker, SS The optimization of pyridazinone series of glucan synthase inhibitors. Bioorg Med Chem Lett 22:5268-71 (2012)  
Target
Name:
1,3-beta-D-glucan synthase catalytic subunit
Synonyms:
1,3-beta-D-glucan synthase catalytic subunit | Beta-1,3-glucan synthase
Type:
PROTEIN
Mol. Mass.:
80469.77
Organism:
Candida albicans
Description:
ChEMBL_663643
Residue:
690
  
Inhibitor
Name:
BDBM50485393
Synonyms:
CHEMBL2059490
Type:
Small organic molecule
Emp. Form.:
C26H28F2N4O5S
Mol. Mass.:
546.586
SMILES:
Oc1cccc(CS(=O)(=O)N2CCN(CC2)c2cnn(-c3cc(F)cc(F)c3)c(=O)c2OC2CCCC2)c1
: