Target
1,3-beta-D-glucan synthase catalytic subunit
Ligand
BDBM50485398
Substrate
Meas. Tech.
ChEMBL_830523 (CHEMBL2061335)
IC50
56.5±n/a nM
Citation
 Kuang, RWu, HTing, PCAslanian, RGCao, JKim, DWLee, JFSchwerdt, JZhou, GHerr, RJZych, AJYang, JLam, SQJenkins, DMSakwa, SAWainhaus, SBlack, TACacciapuoti, AMcNicholas, PMXu, YWalker, SS The optimization of pyridazinone series of glucan synthase inhibitors. Bioorg Med Chem Lett 22:5268-71 (2012)  
Target
Name:
1,3-beta-D-glucan synthase catalytic subunit
Synonyms:
1,3-beta-D-glucan synthase catalytic subunit | Beta-1,3-glucan synthase
Type:
PROTEIN
Mol. Mass.:
80469.77
Organism:
Candida albicans
Description:
ChEMBL_663643
Residue:
690
  
Inhibitor
Name:
BDBM50485398
Synonyms:
CHEMBL2059384
Type:
Small organic molecule
Emp. Form.:
C26H28F2N4O4S
Mol. Mass.:
530.587
SMILES:
Fc1cc(F)cc(c1)-n1ncc(N2CCN(CC2)S(=O)(=O)Cc2ccccc2)c(OC2CCCC2)c1=O
: