Target
Solute carrier family 15 member 1
Ligand
BDBM84007
Substrate
Meas. Tech.
ChEMBL_838002 (CHEMBL2075260)
Ki
1310000±n/a nM
Citation
 Wenzel, UGebert, IWeintraut, HWeber, WMClauss, WDaniel, H Transport characteristics of differently charged cephalosporin antibiotics in oocytes expressing the cloned intestinal peptide transporter PepT1 and in human intestinal Caco-2 cells. J Pharmacol Exp Ther 277:831-9 (1996) Target
Name:
Solute carrier family 15 member 1
Synonyms:
Intestinal H(+)/peptide cotransporter Oligopeptide transporter, small intestine isoform Peptide transporter 1 SLC15A1
Type:
PROTEIN
Mol. Mass.:
78818.07
Organism:
Homo sapiens (Human)
Description:
ChEMBL_1488839
Residue:
708
  
Inhibitor
Name:
BDBM84007
Synonyms:
CEFIXIME MLS002222332 cid_5362065
Type:
Small organic molecule
Emp. Form.:
C16H15N5O7S2
Mol. Mass.:
453.45
SMILES:
Nc1nc(cs1)C(=N\OCC(O)=O)\C(=O)N[C@H]1[C@H]2SCC(C=C)=C(N2C1=O)C(O)=O
: