Target
ATP-dependent translocase ABCB1
Ligand
BDBM50485592
Substrate
Meas. Tech.
ChEMBL_837054 (CHEMBL2076139)
Ki
400±n/a nM
Citation
 Kimura, YAoki, JKohno, MOoka, HTsuruo, TNakanishi, O P-glycoprotein inhibition by the multidrug resistance-reversing agent MS-209 enhances bioavailability and antitumor efficacy of orally administered paclitaxel. Cancer Chemother Pharmacol 49:322-8 (2002)  
Target
Name:
ATP-dependent translocase ABCB1
Synonyms:
ABCB1 MDR1_HUMAN Multidrug resistance protein 1 P-glycoprotein (P-gp) PGY1
Type:
Protein
Mol. Mass.:
141503.50
Organism:
Homo sapiens (Human)
Description:
P08183
Residue:
1280
  
Inhibitor
Name:
BDBM50485592
Synonyms:
CHEMBL350445
Type:
Small organic molecule
Emp. Form.:
C30H31N3O3
Mol. Mass.:
481.5854
SMILES:
[H][C@](O)(COc1cccc2ncccc12)CN1CCN(CC1)C(=O)C(c1ccccc1)c1ccccc1
: