Target
Bcl-2 homologous antagonist/killer/Induced myeloid leukemia cell differentiation protein Mcl-1
Ligand
BDBM50485615
Substrate
Meas. Tech.
ChEMBL_840681 (CHEMBL2090423)
IC50
>50000±n/a nM
Citation
 Yusuff, NDoré, MJoud, CVisser, MSpringer, CXie, XHerlihy, KPorter, DTouré, BB Lipophilic Isosteres of a ?-? Stacking Interaction: New Inhibitors of the Bcl-2-Bak Protein-Protein Interaction. ACS Med Chem Lett 3:579-83 (2012)  
Target
Name:
Bcl-2 homologous antagonist/killer/Induced myeloid leukemia cell differentiation protein Mcl-1
Synonyms:
MCL1-BAK1 complex
Type:
Mol. Mass.:
Description:
ASSAY_ID of ChEMBL is 840681
Components:
This complex has 2 components.
Component 1
Name:
Induced myeloid leukemia cell differentiation protein Mcl-1
Synonyms:
BCL2L3 Bcl-2-like protein 3 (Mcl-1) Bcl2-L-3 MCL1 Mcl-1 Myeloid cell leukemia sequence 1 (BCL2-related) | mcl1/EAT
Type:
Membrane; Single-pass membrane protein
Mol. Mass.:
37332.87
Organism:
Homo sapiens (Human)
Description:
Q07820
Residue:
350
  
Component 2
Name:
Bcl-2 homologous antagonist/killer
Synonyms:
Apoptosis regulator BAK BAK1 BCL2L7 Bcl-2-like protein 7 CDN1
Type:
PROTEIN
Mol. Mass.:
23406.37
Organism:
Homo sapiens
Description:
ChEMBL_117067
Residue:
211
  
Inhibitor
Name:
BDBM50485615
Synonyms:
CHEMBL2089282
Type:
Small organic molecule
Emp. Form.:
C26H28ClN3O3S
Mol. Mass.:
498.037
SMILES:
CCS(=O)(=O)NC(=O)c1ccc(cc1)N1CCN(Cc2ccccc2-c2ccc(Cl)cc2)CC1
: