Target
Bcl-2 homologous antagonist/killer
Ligand
BDBM50485619
Substrate
Meas. Tech.
ChEMBL_840681 (CHEMBL2090423)
IC50
>50000±n/a nM
Citation
 Yusuff, NDoré, MJoud, CVisser, MSpringer, CXie, XHerlihy, KPorter, DTouré, BB Lipophilic Isosteres of a ?-? Stacking Interaction: New Inhibitors of the Bcl-2-Bak Protein-Protein Interaction. ACS Med Chem Lett 3:579-83 (2012)  
Target
Name:
Bcl-2 homologous antagonist/killer
Synonyms:
Apoptosis regulator BAK BAK1 BCL2L7 Bcl-2-like protein 7 CDN1
Type:
PROTEIN
Mol. Mass.:
23406.37
Organism:
Homo sapiens
Description:
ChEMBL_117067
Residue:
211
  
Inhibitor
Name:
BDBM50485619
Synonyms:
CHEMBL2089291
Type:
Small organic molecule
Emp. Form.:
C34H39ClN4O3S
Mol. Mass.:
619.216
SMILES:
Clc1ccc(cc1)-c1ccccc1CN1CCN(CC1)c1ccc(cc1)C(=O)NS(=O)(=O)NC12CC3CC(CC(C3)C1)C2
: