Target
Bcl-2 homologous antagonist/killer
Ligand
BDBM50485620
Substrate
Meas. Tech.
ChEMBL_840681 (CHEMBL2090423)
IC50
>50000±n/a nM
Citation
 Yusuff, NDoré, MJoud, CVisser, MSpringer, CXie, XHerlihy, KPorter, DTouré, BB Lipophilic Isosteres of a ?-? Stacking Interaction: New Inhibitors of the Bcl-2-Bak Protein-Protein Interaction. ACS Med Chem Lett 3:579-83 (2012)  
Target
Name:
Bcl-2 homologous antagonist/killer
Synonyms:
Apoptosis regulator BAK BAK1 BCL2L7 Bcl-2-like protein 7 CDN1
Type:
PROTEIN
Mol. Mass.:
23406.37
Organism:
Homo sapiens
Description:
ChEMBL_117067
Residue:
211
  
Inhibitor
Name:
BDBM50485620
Synonyms:
CHEMBL2089293
Type:
Small organic molecule
Emp. Form.:
C36H42ClN3O3S
Mol. Mass.:
632.255
SMILES:
Clc1ccc(cc1)-c1ccccc1CN1CCN(CC1)c1ccc(cc1)C(=O)NS(=O)(=O)CC12CC3CC(C1)CCC(C3)C2
: