Target
Bcl-2 homologous antagonist/killer
Ligand
BDBM50485625
Substrate
Meas. Tech.
ChEMBL_840681 (CHEMBL2090423)
IC50
>50000±n/a nM
Citation
 Yusuff, NDoré, MJoud, CVisser, MSpringer, CXie, XHerlihy, KPorter, DTouré, BB Lipophilic Isosteres of a ?-? Stacking Interaction: New Inhibitors of the Bcl-2-Bak Protein-Protein Interaction. ACS Med Chem Lett 3:579-83 (2012)  
Target
Name:
Bcl-2 homologous antagonist/killer
Synonyms:
Apoptosis regulator BAK BAK1 BCL2L7 Bcl-2-like protein 7 CDN1
Type:
PROTEIN
Mol. Mass.:
23406.37
Organism:
Homo sapiens
Description:
ChEMBL_117067
Residue:
211
  
Inhibitor
Name:
BDBM50485625
Synonyms:
CHEMBL2089288
Type:
Small organic molecule
Emp. Form.:
C36H44ClN3O3S
Mol. Mass.:
634.271
SMILES:
C[C@]12C[C@](C)([C@H](CS(=O)(=O)NC(=O)c3ccc(cc3)N3CCN(Cc4ccccc4-c4ccc(Cl)cc4)CC3)CC1)C2(C)C
: