Target
Bcl-2 homologous antagonist/killer
Ligand
BDBM50485627
Substrate
Meas. Tech.
ChEMBL_840681 (CHEMBL2090423)
IC50
>50000±n/a nM
Citation
 Yusuff, NDoré, MJoud, CVisser, MSpringer, CXie, XHerlihy, KPorter, DTouré, BB Lipophilic Isosteres of a ?-? Stacking Interaction: New Inhibitors of the Bcl-2-Bak Protein-Protein Interaction. ACS Med Chem Lett 3:579-83 (2012)  
Target
Name:
Bcl-2 homologous antagonist/killer
Synonyms:
Apoptosis regulator BAK BAK1 BCL2L7 Bcl-2-like protein 7 CDN1
Type:
PROTEIN
Mol. Mass.:
23406.37
Organism:
Homo sapiens
Description:
ChEMBL_117067
Residue:
211
  
Inhibitor
Name:
BDBM50485627
Synonyms:
CHEMBL2089283
Type:
Small organic molecule
Emp. Form.:
C28H32ClN3O3S
Mol. Mass.:
526.09
SMILES:
CC(C)(C)S(=O)(=O)NC(=O)c1ccc(cc1)N1CCN(Cc2ccccc2-c2ccc(Cl)cc2)CC1
: