Target
Serine/threonine-protein kinase B-raf
Ligand
BDBM50485675
Substrate
Meas. Tech.
ChEMBL_851330 (CHEMBL2156037)
IC50
180±n/a nM
Citation
 Wenglowsky, SMoreno, DLaird, ERGloor, SLRen, LRisom, TRudolph, JSturgis, HLVoegtli, WC Pyrazolopyridine inhibitors of B-Raf(V600E). Part 4: rational design and kinase selectivity profile of cell potent type II inhibitors. Bioorg Med Chem Lett 22:6237-41 (2012)  
Target
Name:
Serine/threonine-protein kinase B-raf
Synonyms:
B-RAF B-Raf proto-oncogene serine/threonine-protein kinase BRAF1 RAFB1 v-Raf murine sarcoma viral oncogene homolog B1
Type:
Serine/threonine-protein kinase
Mol. Mass.:
84446.00
Organism:
Homo sapiens (Human)
Description:
P15056
Residue:
766
  
Inhibitor
Name:
BDBM50485675
Synonyms:
CHEMBL2153510
Type:
Small organic molecule
Emp. Form.:
C25H20F2N6O3
Mol. Mass.:
490.4615
SMILES:
COc1n[nH]c2ncc(NC(=O)c3c(F)ccc(NC(=O)c4cccc(c4)C(C)(C)C#N)c3F)cc12
: