Target
Serine/threonine-protein kinase B-raf
Ligand
BDBM50485681
Substrate
Meas. Tech.
ChEMBL_851329 (CHEMBL2156036)
IC50
39±n/a nM
Citation
 Wenglowsky, SMoreno, DLaird, ERGloor, SLRen, LRisom, TRudolph, JSturgis, HLVoegtli, WC Pyrazolopyridine inhibitors of B-Raf(V600E). Part 4: rational design and kinase selectivity profile of cell potent type II inhibitors. Bioorg Med Chem Lett 22:6237-41 (2012)  
Target
Name:
Serine/threonine-protein kinase B-raf
Synonyms:
B-RAF B-Raf proto-oncogene serine/threonine-protein kinase BRAF1 RAFB1 v-Raf murine sarcoma viral oncogene homolog B1
Type:
Serine/threonine-protein kinase
Mol. Mass.:
84446.00
Organism:
Homo sapiens (Human)
Description:
P15056
Residue:
766
  
Inhibitor
Name:
BDBM50485681
Synonyms:
CHEMBL2153509
Type:
Small organic molecule
Emp. Form.:
C21H15F2N5O3
Mol. Mass.:
423.3723
SMILES:
COc1n[nH]c2ncc(NC(=O)c3c(F)ccc(NC(=O)c4ccccc4)c3F)cc12
: