Target
Calmodulin-sensitive adenylate cyclase
Ligand
BDBM50486019
Substrate
Meas. Tech.
ChEMBL_884651 (CHEMBL2214667)
IC50
80000±n/a nM
Citation
 Chen, DMa, LKanalas, JJGao, JPawlik, JJimenez, MEWalter, MAPeterson, JWGilbertson, SRSchein, CH Structure-based redesign of an edema toxin inhibitor. Bioorg Med Chem 20:368-76 (2012)  
Target
Name:
Calmodulin-sensitive adenylate cyclase
Synonyms:
CYAA_BACAN | cya
Type:
PROTEIN
Mol. Mass.:
92481.33
Organism:
Bacillus anthracis
Description:
ChEMBL_606615
Residue:
800
  
Inhibitor
Name:
BDBM50486019
Synonyms:
CHEMBL2203668
Type:
Small organic molecule
Emp. Form.:
C21H14N2O4
Mol. Mass.:
358.3469
SMILES:
Nc1ccc(NC(=O)c2cccc3-c4ccccc4C(=O)c23)c(c1)C(O)=O
: