Target
Calmodulin-sensitive adenylate cyclase
Ligand
BDBM50486028
Substrate
Meas. Tech.
ChEMBL_884651 (CHEMBL2214667)
IC50
>100000±n/a nM
Citation
 Chen, DMa, LKanalas, JJGao, JPawlik, JJimenez, MEWalter, MAPeterson, JWGilbertson, SRSchein, CH Structure-based redesign of an edema toxin inhibitor. Bioorg Med Chem 20:368-76 (2012)  
Target
Name:
Calmodulin-sensitive adenylate cyclase
Synonyms:
CYAA_BACAN | cya
Type:
PROTEIN
Mol. Mass.:
92481.33
Organism:
Bacillus anthracis
Description:
ChEMBL_606615
Residue:
800
  
Inhibitor
Name:
BDBM50486028
Synonyms:
3-Benzoylamino-Benzoic Acid | CHEMBL1513568
Type:
Small organic molecule
Emp. Form.:
C14H11NO3
Mol. Mass.:
241.242
SMILES:
OC(=O)c1cccc(NC(=O)c2ccccc2)c1
: