Target
Genome polyprotein
Ligand
BDBM50486090
Substrate
Meas. Tech.
ChEMBL_885186 (CHEMBL2213720)
Ki
2.8±n/a nM
Citation
 Rudd, MTMcIntyre, CJRomano, JJButcher, JWHolloway, MKBush, KNguyen, KTGilbert, KFLyle, TALiverton, NJWan, BLSumma, VHarper, SRowley, MVacca, JPCarroll, SSBurlein, CDiMuzio, JMGates, AGraham, DJHuang, QLudmerer, SWMcClain, SMcHale, CStahlhut, MFandozzi, CTaylor, ATrainor, NOlsen, DBMcCauley, JA Development of macrocyclic inhibitors of HCV NS3/4A protease with cyclic constrained P2-P4 linkers. Bioorg Med Chem Lett 22:7207-13 (2012)  
Target
Name:
Genome polyprotein
Synonyms:
Genome polyprotein
Type:
PROTEIN
Mol. Mass.:
74061.95
Organism:
Hepacivirus C
Description:
ChEMBL_118425
Residue:
694
  
Inhibitor
Name:
BDBM50486090
Synonyms:
CHEMBL2203882
Type:
Small organic molecule
Emp. Form.:
C42H55N5O10S
Mol. Mass.:
821.979
SMILES:
[H][C@@]12C[C@]1([H])c1cc3c(O[C@]4([H])C[C@H](N(C4)C(=O)[C@@H](NC(=O)OCC(C)(C)C2)C2CCCC2)C(=O)N[C@@]2(C[C@H]2C=C)C(=O)NS(=O)(=O)C2CC2)cc(OCC)nc3cc1OC
: