Target
Genome polyprotein
Ligand
BDBM50486104
Substrate
Meas. Tech.
ChEMBL_885186 (CHEMBL2213720)
Ki
28±n/a nM
Citation
 Rudd, MTMcIntyre, CJRomano, JJButcher, JWHolloway, MKBush, KNguyen, KTGilbert, KFLyle, TALiverton, NJWan, BLSumma, VHarper, SRowley, MVacca, JPCarroll, SSBurlein, CDiMuzio, JMGates, AGraham, DJHuang, QLudmerer, SWMcClain, SMcHale, CStahlhut, MFandozzi, CTaylor, ATrainor, NOlsen, DBMcCauley, JA Development of macrocyclic inhibitors of HCV NS3/4A protease with cyclic constrained P2-P4 linkers. Bioorg Med Chem Lett 22:7207-13 (2012)  
Target
Name:
Genome polyprotein
Synonyms:
Genome polyprotein
Type:
PROTEIN
Mol. Mass.:
74061.95
Organism:
Hepacivirus C
Description:
ChEMBL_118425
Residue:
694
  
Inhibitor
Name:
BDBM50486104
Synonyms:
CHEMBL2203895
Type:
Small organic molecule
Emp. Form.:
C40H50N6O9S
Mol. Mass.:
790.925
SMILES:
[H][C@@]12C[C@H](N(C1)C(=O)[C@@H](NC(=O)N1CC(C1)OCCC\C=C\c1cc3ccc(OC)cc3nc1O2)C1CCCC1)C(=O)N[C@@]1(C[C@H]1C=C)C(=O)NS(=O)(=O)C1CC1
: