Target
Protoporphyrinogen oxidase
Ligand
BDBM50359925
Substrate
Meas. Tech.
ChEMBL_893548 (CHEMBL3049525)
Ki
320±n/a nM
Citation
 Jiang, LLTan, YZhu, XLWang, ZFZuo, YChen, QXi, ZYang, GF Design, synthesis, and 3D-QSAR analysis of novel 1,3,4-oxadiazol-2(3H)-ones as protoporphyrinogen oxidase inhibitors. J Agric Food Chem 58:2643-51 (2010)  
Target
Name:
Protoporphyrinogen oxidase
Synonyms:
PPO PPOX_HUMAN
Type:
PROTEIN
Mol. Mass.:
50774.78
Organism:
Homo sapiens (Human)
Description:
ChEMBL_791250
Residue:
477
  
Inhibitor
Name:
BDBM50359925
Synonyms:
CHEMBL1926960
Type:
Small organic molecule
Emp. Form.:
C18H20FN3O4S2
Mol. Mass.:
425.498
SMILES:
CCOC(=O)CCSc1nc2cc(c(F)cc2s1)-n1nc(oc1=O)C(C)(C)C
: