Target
Prothrombin
Ligand
BDBM50029513
Substrate
Meas. Tech.
ChEMBL_210582 (CHEMBL816532)
IC50
3300±n/a nM
Citation
 Shuman, RTRothenberger, RBCampbell, CSSmith, GFGifford-Moore, DSPaschal, JWGesellchen, PD Structure-activity study of tripeptide thrombin inhibitors using alpha-alkyl amino acids and other conformationally constrained amino acid substitutions. J Med Chem 38:4446-53 (1995)  
Target
Name:
Prothrombin
Synonyms:
Activation peptide fragment 1 Coagulation factor II Prothrombin Thrombin Thrombin light chain
Type:
Enzyme
Mol. Mass.:
70502.73
Organism:
Bos taurus (Bovine)
Description:
P00735
Residue:
625
  
Inhibitor
Name:
BDBM50029513
Synonyms:
(S)-1-((4aS,8aS)-Decahydro-isoquinoline-3-carbonyl)-pyrrolidine-2-carboxylic acid ((S)-1-formyl-4-guanidino-butyl)-amide | CHEMBL2370865
Type:
Small organic molecule
Emp. Form.:
C21H36N6O3
Mol. Mass.:
420.5489
SMILES:
[H][C@]12CCCC[C@@]1([H])C[C@H](NC2)C(=O)N1CCC[C@H]1C(=O)N[C@@H](CCCNC(N)=N)C=O
: