Target
Beta-lactamase SHV-5
Ligand
BDBM50486725
Substrate
Meas. Tech.
ChEMBL_901119 (CHEMBL3061796)
Ki
1360±n/a nM
Citation
  TBA Med Chem Res 21:2229-2237 (2012)    Article 
Target
Name:
Beta-lactamase SHV-5
Synonyms:
BLA5_KLEPN shv5
Type:
PROTEIN
Mol. Mass.:
31257.78
Organism:
Klebsiella pneumoniae
Description:
ChEMBL_754353
Residue:
286
  
Inhibitor
Name:
BDBM50486725
Synonyms:
CHEMBL2236666
Type:
Small organic molecule
Emp. Form.:
C22H19N2NaO9S
Mol. Mass.:
510.449
SMILES:
[Na;v0+].[#6][C@]1([#6]-[#8]-[#6](=O)-[#6]-c2ccc(-[#8])c(-[#8])c2)[#6@@H](-[#7]-2-[#6@@H](\[#6](=[#6]/c3ccccn3)-[#6]-2=O)S1(=O)=O)-[#6](-[#8-])=O
: