Target
Neutrophil elastase
Ligand
BDBM50029691
Substrate
Meas. Tech.
ChEMBL_64004 (CHEMBL672345)
Ki
0.034±n/a nM
Citation
 Hlasta, DJAckerman, JHCourt, JJFarrell, RPJohnson, JAKofron, JLRobinson, DTTalomie, TGDunlap, RPFranke, CA A novel class of cyclic beta-dicarbonyl leaving groups and their use in the design of benzisothiazolone human leukocyte elastase inhibitors. J Med Chem 38:4687-92 (1995)  
Target
Name:
Neutrophil elastase
Synonyms:
Bone marrow serine protease Coagulation factor X ELANE Elastase HLE Leukocyte elastase Medullasin Neutrophil elastase (HNE) PMN elastase Trypsin
Type:
Enzyme
Mol. Mass.:
28532.38
Organism:
Homo sapiens (Human)
Description:
P08246
Residue:
267
  
Inhibitor
Name:
BDBM50029691
Synonyms:
2-(2-Benzyl-3-oxo-cyclopent-1-enyloxymethyl)-4-isopropyl-6-methoxy-1,1-dioxo-1,2-dihydro-1lambda*6*-benzo[d]isothiazol-3-one | CHEMBL357694
Type:
Small organic molecule
Emp. Form.:
C24H25NO6S
Mol. Mass.:
455.523
SMILES:
COc1cc2c(C(=O)N(COC3=C(Cc4ccccc4)C(=O)CC3)S2(=O)=O)c(c1)C(C)C
: