Target
Amine oxidase [flavin-containing] B
Ligand
BDBM50029815
Substrate
Meas. Tech.
ChEMBL_123927 (CHEMBL729461)
IC50
2±n/a nM
Citation
 Lebreton, LCuret, OGueddari, SMazouz, FBernard, SBurstein, CMilcent, R Selective and potent monoamine oxidase type B inhibitors: 2-substituted 5-aryltetrazole derivatives. J Med Chem 38:4786-92 (1996)  
Target
Name:
Amine oxidase [flavin-containing] B
Synonyms:
AOFB_RAT Amine oxidase [flavin-containing] B Monoamine Oxidase Type B (MAO-B) Monoamine oxidase B (MAO-B) Monoamine oxidase type B (MAOB) | Monoamine oxidase-B (MAO-B)
Type:
Enzyme
Mol. Mass.:
58469.65
Organism:
Rattus norvegicus (rat)
Description:
P19643
Residue:
520
  
Inhibitor
Name:
BDBM50029815
Synonyms:
3-[5-(4-Benzyloxy-phenyl)-tetrazol-2-yl]-propionitrile | CHEMBL434261
Type:
Small organic molecule
Emp. Form.:
C17H15N5O
Mol. Mass.:
305.3339
SMILES:
N#CCCn1nnc(n1)-c1ccc(OCc2ccccc2)cc1
: