Target
Amine oxidase [flavin-containing] A
Ligand
BDBM50029815
Substrate
Meas. Tech.
ChEMBL_122945 (CHEMBL733230)
IC50
86000±n/a nM
Citation
 Lebreton, LCuret, OGueddari, SMazouz, FBernard, SBurstein, CMilcent, R Selective and potent monoamine oxidase type B inhibitors: 2-substituted 5-aryltetrazole derivatives. J Med Chem 38:4786-92 (1996)  
Target
Name:
Amine oxidase [flavin-containing] A
Synonyms:
AOFA_RAT Amine oxidase [flavin-containing] A Monoamine Oxidase Type A (MAO-A) Monoamine oxidase A (MAO-A) Monoamine oxidase type A (MAOA)
Type:
Enzyme
Mol. Mass.:
59515.21
Organism:
Rattus norvegicus (rat)
Description:
Residue:
526
  
Inhibitor
Name:
BDBM50029815
Synonyms:
3-[5-(4-Benzyloxy-phenyl)-tetrazol-2-yl]-propionitrile | CHEMBL434261
Type:
Small organic molecule
Emp. Form.:
C17H15N5O
Mol. Mass.:
305.3339
SMILES:
N#CCCn1nnc(n1)-c1ccc(OCc2ccccc2)cc1
: