Target
Integrin alpha-V/beta-5
Ligand
BDBM50030032
Substrate
Meas. Tech.
ChEMBL_217625 (CHEMBL820368)
IC50
5820.0±n/a nM
Citation
 Cheng, SCraig, WSMullen, DTschopp, JFDixon, DPierschbacher, MD Design and synthesis of novel cyclic RGD-containing peptides as highly potent and selective integrin alpha IIb beta 3 antagonists. J Med Chem 37:1-8 (1994)  
Target
Name:
Integrin alpha-V/beta-5
Synonyms:
ITGAV/ITGB5 | Integrin beta-5/Vitronectin receptor alpha
Type:
Enzyme
Mol. Mass.:
Description:
Components:
This complex has 2 components.
Component 1
Name:
Integrin alpha-V
Synonyms:
ITAV_HUMAN Integrin alpha-V/alpha-5 VNRA Vitronectin receptor | Vitronectin receptor subunit alpha
Type:
PROTEIN
Mol. Mass.:
116024.92
Organism:
Homo sapiens (Human)
Description:
ChEMBL_582336
Residue:
1048
  
Component 2
Name:
Integrin beta-5
Synonyms:
ITB5_HUMAN | ITGB5
Type:
PROTEIN
Mol. Mass.:
88047.37
Organism:
Homo sapiens (Human)
Description:
EBI_10915
Residue:
799
  
Inhibitor
Name:
BDBM50030032
Synonyms:
Ac-C-N-P-R-G-D-(Y-OMe)-K-C-NH2 | CHEMBL267950
Type:
Small organic molecule
Emp. Form.:
C45H69N15O14S2
Mol. Mass.:
1108.251
SMILES:
COc1ccc(C[C@@H]2NC(=O)[C@@H](CC(O)=O)NC(=O)CNC(=O)[C@@H](CCCNC(N)=N)NC(=O)[C@@H]3CCCN3C(=O)[C@@H](CC(N)=O)NC(=O)[C@@H](CSSC[C@@H](NC(=O)[C@@H](CCCCN)NC2=O)C(N)=O)NC(C)=O)cc1
: